spamassassin make test Fehler

Postfix, QMail, Sendmail, Dovecot, Cyrus, Courier, Anti-Spam
bigbutt
Posts: 18
Joined: 2003-01-02 15:15

spamassassin make test Fehler

Post by bigbutt » 2003-03-26 09:28

Hallo,

bei make test bekomme ich folgende Fehlermeldungen:

Code: Select all

PERL_DL_NONLAZY=1 /usr/bin/perl -Iblib/arch -Iblib/lib -I/usr/lib/perl5/5.00503/i586-linux -I/usr/lib/perl5/5.00503 -e 'use Test::Harness qw(&runtests $verbose); $verbose=0; runtests @ARGV;' t/*.t
t/basic_lint................FAILED test 1
        Failed 1/1 tests, 0.00% okay
t/db_awl_path...............FAILED test 2
        Failed 1/2 tests, 50.00% okay
t/db_based_whitelist........FAILED tests 1-8
        Failed 8/8 tests, 0.00% okay
t/db_based_whitelist_ips....FAILED tests 1-8
        Failed 8/8 tests, 0.00% okay
t/forged_rcvd...............FAILED tests 1-2
        Failed 2/2 tests, 0.00% okay
t/lang_pl_tests.............FAILED test 1
        Failed 1/1 tests, 0.00% okay
t/nonspam...................FAILED test 1
        Failed 1/1 tests, 0.00% okay
t/razor.....................skipped
        all skipped: no reason given
t/razor2....................skipped
        all skipped: no reason given
t/reportheader..............FAILED tests 1-14
        Failed 14/14 tests, 0.00% okay
t/spam......................FAILED tests 1-11
        Failed 11/11 tests, 0.00% okay
t/spamd.....................
Woran könnte das liegen?

bigbuTT

cybernd
Posts: 83
Joined: 2002-08-08 14:39

Re: spamassassin make test Fehler

Post by cybernd » 2003-03-26 13:27

mhmm maybe fehlt ihm eine benötigte lib?

hab unter server.cybernd.at in der perl howto die für spamassassin benötigten module gelistet

bei mir klappte die installation auf diese tour zumindestens problemlos
lediglich der razor check bei der installation bringt immer ein failure => razor funktioniert aber dennoch in kombination von spamassassin - manche spammails werden auch razor gewertet ... sind zumeist 2 punkte im spamassassin check

hth
cybi

bigbutt
Posts: 18
Joined: 2003-01-02 15:15

Re: spamassassin make test Fehler

Post by bigbutt » 2003-03-26 14:02

mir fehlte POD::Usage

Nu läuft alles :)

bigbuTT