Qmail und Suse 8.2

Postfix, QMail, Sendmail, Dovecot, Cyrus, Courier, Anti-Spam
lestart
Posts: 6
Joined: 2003-02-25 12:32

Qmail und Suse 8.2

Post by lestart » 2003-06-12 10:36

Hi Folks,
also ich size hier seit 2 Tagen an Suse8.2 und qmail!
Weder qmail noch qinstall( ist zwar fast das gleiche) bekomme ich es installiert!
Folgende Fehlermeldung!

Code: Select all

./compile byte_rchr.c
./compile fmt_uint.c
./compile fmt_uint0.c
./compile fmt_ulong.c
./compile scan_ulong.c
./compile str_chr.c
./compile str_diff.c
./compile str_len.c
./compile str_start.c
./makelib byte.a byte_chr.o byte_copy.o byte_cr.o 
byte_diff.o byte_rchr.o fmt_uint.o fmt_uint0.o fmt_ulong.o 
scan_ulong.o str_chr.o str_diff.o str_len.o str_start.o
./load svscan unix.a byte.a
svscan.o(.text+0x517): In function `doit':
: undefined reference to `errno'
svscan.o(.text+0x575): In function `doit':
: undefined reference to `errno'
svscan.o(.text+0x58b): In function `doit':
: undefined reference to `errno'
unix.a(pathexec_run.o)(.text+0xf6): In function `pathexec_run':
: undefined reference to `errno'
unix.a(pathexec_run.o)(.text+0x16e): In function `pathexec_run':
: undefined reference to `errno'
unix.a(strerr_sys.o)(.text+0x7): more undefined references to `errno' follow
collect2: ld returned 1 exit status
make: *** [svscan] Error 1
./load svscan unix.a byte.a
svscan.o(.text+0x517): In function `doit':
: undefined reference to `errno'
svscan.o(.text+0x575): In function `doit':
: undefined reference to `errno'
svscan.o(.text+0x58b): In function `doit':
: undefined reference to `errno'
unix.a(pathexec_run.o)(.text+0xf6): In function `pathexec_run':
: undefined reference to `errno'
unix.a(pathexec_run.o)(.text+0x16e): In function `pathexec_run':
: undefined reference to `errno'
unix.a(strerr_sys.o)(.text+0x7): more undefined references to `errno' follow
collect2: ld returned 1 exit status
make: *** [svscan] Error 1
Daemontools installation DONE.
sh: line 1: /var/qmail/control/defaultdelivery: No such file or directory
sh: line 1: /var/qmail/control/concurrencyincoming: No such file or directory
Traceback (most recent call last):
  File "qinstallcore.py", line 682, in ?
  File "qinstallcore.py", line 649, in install_all
  File "qinstallcore.py", line 531, in qmail_install
OSError: [Errno 2] No such file or directory: '/var/qmail/control/concurrencyincoming
ich habe alles wie in den HowTo´s gemacht! Unter Mandrake bekomme ich es zum laufen nur nicht unter Suse.
Kann mir einer bitte helfen?

THX Lestart

Anonymous

Re: Qmail und Suse 8.2

Post by Anonymous » 2003-06-12 11:36

Dir fehlen development libs.
Durchforste mal yast

Karlo

lestart
Posts: 6
Joined: 2003-02-25 12:32

Re: Qmail und Suse 8.2

Post by lestart » 2003-06-12 12:43

Hi und am verzweifeln,
Dir fehlen development libs.
Durchforste mal yast

Karlo
Habe jezt alle installiert und trozdem:

Code: Select all

./makelib byte.a byte_chr.o byte_copy.o byte_cr.o 
byte_diff.o byte_rchr.o fmt_uint.o fmt_uint0.o fmt_ulong.o 
scan_ulong.o str_chr.o str_diff.o str_len.o str_start.o
./load svscan unix.a byte.a
svscan.o(.text+0x517): In function `doit':
: undefined reference to `errno'
svscan.o(.text+0x575): In function `doit':
: undefined reference to `errno'
svscan.o(.text+0x58b): In function `doit':
: undefined reference to `errno'
unix.a(pathexec_run.o)(.text+0xf6): In function `pathexec_run':
: undefined reference to `errno'
unix.a(pathexec_run.o)(.text+0x16e): In function `pathexec_run':
: undefined reference to `errno'
unix.a(strerr_sys.o)(.text+0x7): more undefined references to `errno' follow
collect2: ld returned 1 exit status
make: *** [svscan] Error 1
./load svscan unix.a byte.a
svscan.o(.text+0x517): In function `doit':
: undefined reference to `errno'
svscan.o(.text+0x575): In function `doit':
: undefined reference to `errno'
svscan.o(.text+0x58b): In function `doit':
: undefined reference to `errno'
unix.a(pathexec_run.o)(.text+0xf6): In function `pathexec_run':
: undefined reference to `errno'
unix.a(pathexec_run.o)(.text+0x16e): In function `pathexec_run':
: undefined reference to `errno'
unix.a(strerr_sys.o)(.text+0x7): more undefined references to `errno' follow
collect2: ld returned 1 exit status
make: *** [svscan] Error 1
Daemontools installation DONE.
sh: line 1: /var/qmail/control/defaultdelivery: No such file or directory
sh: line 1: /var/qmail/control/concurrencyincoming: No such file or directory
Traceback (most recent call last):
  File "qinstallcore.py", line 682, in ?
  File "qinstallcore.py", line 649, in install_all
  File "qinstallcore.py", line 531, in qmail_install
OSError: [Errno 2] No such file or directory: '/var/qmail/control/concurrencyincoming'
Woran kann es noch liegen?
Suse 8.2 Prof

DANKE DANKE DANKE!!!!
Wäre echt super von Euch!!!

cya Lestart

flotte
Posts: 93
Joined: 2002-09-13 23:27

Re: Qmail und Suse 8.2

Post by flotte » 2003-06-13 00:14


lestart
Posts: 6
Joined: 2003-02-25 12:32

thx

Post by lestart » 2003-06-13 23:12

Danke, werde es mal ausprobieren!
cya Lestart